Target
Mu-type opioid receptor
Ligand
BDBM50133890
Substrate
Meas. Tech.
ChEMBL_1526571 (CHEMBL3635647)
Ki
0.030000±n/a nM
Citation
 Harland, AAYeomans, LGriggs, NWAnand, JPPogozheva, IDJutkiewicz, EMTraynor, JRMosberg, HI Further Optimization and Evaluation of Bioavailable, Mixed-Efficacyµ-Opioid Receptor (MOR) Agonists/d-Opioid Receptor (DOR) Antagonists: Balancing MOR and DOR Affinities. J Med Chem 58:8952-69 (2015)  
Target
Name:
Mu-type opioid receptor
Synonyms:
MOR-1 Mu-type opioid receptor (MOR) OPRM_RAT Opioid receptor B Ror-b
Type:
G Protein-Coupled Receptor (GPCR)
Mol. Mass.:
44503.11
Organism:
Rattus norvegicus (rat)
Description:
Competition binding assays were carried out using membrane preparations from transfected HN9.10 cells that constitutively expressed the mu opioid receptor.
Residue:
398
  
Inhibitor
Name:
BDBM50133890
Synonyms:
CHEMBL3634258
Type:
Small organic molecule
Emp. Form.:
C32H37N3O3
Mol. Mass.:
511.6545
SMILES:
CC(=O)N1CC[C@@H](NC(=O)[C@@H](N)Cc2c(C)cc(O)cc2C)c2cc(CC3CCc4ccccc34)ccc12
: