Target
Reverse transcriptase
Ligand
BDBM50134209
Substrate
Meas. Tech.
ChEMBL_1542247 (CHEMBL3745469)
IC50
1.1±n/a nM
Citation
 Gray, WTFrey, KMLaskey, SBMislak, ACSpasov, KALee, WGBollini, MSiliciano, RFJorgensen, WLAnderson, KS Potent Inhibitors Active against HIV Reverse Transcriptase with K101P, a Mutation Conferring Rilpivirine Resistance. ACS Med Chem Lett 6:1075-9 (2015)  
Target
Name:
Reverse transcriptase
Synonyms:
Type:
Protein
Mol. Mass.:
29598.37
Organism:
Human immunodeficiency virus 1
Description:
Q9WKE8
Residue:
254
  
Inhibitor
Name:
BDBM50134209
Synonyms:
CHEMBL3342974
Type:
Small organic molecule
Emp. Form.:
C21H16N4O4
Mol. Mass.:
388.3761
SMILES:
O=c1ccn(CCOc2ccccc2Oc2cccn3cc(cc23)C#N)c(=O)[nH]1
: