Target
Peroxisome proliferator-activated receptor delta
Ligand
BDBM50134239
Substrate
Meas. Tech.
ChEMBL_1541803 (CHEMBL3742617)
IC50
1930±n/a nM
Citation
 Kaupang, ÅKase, ETVo, CXAmundsen, MVik, AHansen, TV Synthesis of 5-trifluoromethyl-2-sulfonylpyridine PPARß/d antagonists: Effects on the affinity and selectivity towards PPARß/d. Bioorg Med Chem 24:247-60 (2016)  
Target
Name:
Peroxisome proliferator-activated receptor delta
Synonyms:
NR1C2 NUCI Nuclear receptor subfamily 1 group C member 2 PPAR-beta PPARD Peroxisome proliferator-activated receptor Peroxisome proliferator-activated receptor delta
Type:
Enzyme
Mol. Mass.:
49910.45
Organism:
Homo sapiens (Human)
Description:
Q03181
Residue:
441
  
Inhibitor
Name:
BDBM50134239
Synonyms:
CHEMBL3740264
Type:
Small organic molecule
Emp. Form.:
C19H15F3N2O3S
Mol. Mass.:
408.394
SMILES:
FC(F)(F)c1ccc(nc1)S(=O)(=O)CCNC(=O)c1ccc2ccccc2c1
: