Target
Peroxisome proliferator-activated receptor delta
Ligand
BDBM50079260
Substrate
Meas. Tech.
ChEMBL_1541984 (CHEMBL3743870)
IC50
301±n/a nM
Citation
 Kaupang, ÅKase, ETVo, CXAmundsen, MVik, AHansen, TV Synthesis of 5-trifluoromethyl-2-sulfonylpyridine PPARß/d antagonists: Effects on the affinity and selectivity towards PPARß/d. Bioorg Med Chem 24:247-60 (2016)  
Target
Name:
Peroxisome proliferator-activated receptor delta
Synonyms:
NR1C2 NUCI Nuclear receptor subfamily 1 group C member 2 PPAR-beta PPARD Peroxisome proliferator-activated receptor Peroxisome proliferator-activated receptor delta
Type:
Enzyme
Mol. Mass.:
49910.45
Organism:
Homo sapiens (Human)
Description:
Q03181
Residue:
441
  
Inhibitor
Name:
BDBM50079260
Synonyms:
CHEMBL3416764
Type:
Small organic molecule
Emp. Form.:
C20H15F6N3O3S2
Mol. Mass.:
523.472
SMILES:
Cc1nc(sc1C(=O)NCCS(=O)(=O)c1ccc(cn1)C(F)(F)F)-c1ccc(cc1)C(F)(F)F
: