Target
Peroxisome proliferator-activated receptor delta
Ligand
BDBM50383371
Substrate
Meas. Tech.
ChEMBL_1541804 (CHEMBL3742618)
IC50
30±n/a nM
Citation
 Kaupang, ÅKase, ETVo, CXAmundsen, MVik, AHansen, TV Synthesis of 5-trifluoromethyl-2-sulfonylpyridine PPARß/d antagonists: Effects on the affinity and selectivity towards PPARß/d. Bioorg Med Chem 24:247-60 (2016)  
Target
Name:
Peroxisome proliferator-activated receptor delta
Synonyms:
NR1C2 NUCI Nuclear receptor subfamily 1 group C member 2 PPAR-beta PPARD Peroxisome proliferator-activated receptor Peroxisome proliferator-activated receptor delta
Type:
Enzyme
Mol. Mass.:
49910.45
Organism:
Homo sapiens (Human)
Description:
Q03181
Residue:
441
  
Inhibitor
Name:
BDBM50383371
Synonyms:
CHEMBL2030550
Type:
Small organic molecule
Emp. Form.:
C20H20BrN3
Mol. Mass.:
382.297
SMILES:
CN1CCN(CC1)c1ccc(\C=C(/C#N)c2ccccc2Br)cc1
: