Target
Peroxisome proliferator-activated receptor delta
Ligand
BDBM50134237
Substrate
Meas. Tech.
ChEMBL_1541984 (CHEMBL3743870)
IC50
907±n/a nM
Citation
 Kaupang, ÅKase, ETVo, CXAmundsen, MVik, AHansen, TV Synthesis of 5-trifluoromethyl-2-sulfonylpyridine PPARß/d antagonists: Effects on the affinity and selectivity towards PPARß/d. Bioorg Med Chem 24:247-60 (2016)  
Target
Name:
Peroxisome proliferator-activated receptor delta
Synonyms:
NR1C2 NUCI Nuclear receptor subfamily 1 group C member 2 PPAR-beta PPARD Peroxisome proliferator-activated receptor Peroxisome proliferator-activated receptor delta
Type:
Enzyme
Mol. Mass.:
49910.45
Organism:
Homo sapiens (Human)
Description:
Q03181
Residue:
441
  
Inhibitor
Name:
BDBM50134237
Synonyms:
CHEMBL3740369
Type:
Small organic molecule
Emp. Form.:
C19H19F3N2O3S
Mol. Mass.:
412.426
SMILES:
FC(F)(F)c1ccc(nc1)S(=O)(=O)CCNC(=O)c1ccc2CCCCc2c1
: