Target
Peroxisome proliferator-activated receptor delta
Ligand
BDBM50134238
Substrate
Meas. Tech.
ChEMBL_1541985 (CHEMBL3743871)
IC50
1431±n/a nM
Citation
 Kaupang, ÅKase, ETVo, CXAmundsen, MVik, AHansen, TV Synthesis of 5-trifluoromethyl-2-sulfonylpyridine PPARß/d antagonists: Effects on the affinity and selectivity towards PPARß/d. Bioorg Med Chem 24:247-60 (2016)  
Target
Name:
Peroxisome proliferator-activated receptor delta
Synonyms:
NR1C2 NUCI Nuclear receptor subfamily 1 group C member 2 PPAR-beta PPARD Peroxisome proliferator-activated receptor Peroxisome proliferator-activated receptor delta
Type:
Enzyme
Mol. Mass.:
49910.45
Organism:
Homo sapiens (Human)
Description:
Q03181
Residue:
441
  
Inhibitor
Name:
BDBM50134238
Synonyms:
CHEMBL3740002
Type:
Small organic molecule
Emp. Form.:
C18H14F3N3O3S
Mol. Mass.:
409.382
SMILES:
FC(F)(F)c1ccc(nc1)S(=O)(=O)CCNC(=O)c1cnc2ccccc2c1
: