Target
Amyloid-beta precursor protein
Ligand
BDBM7462
Substrate
Meas. Tech.
ChEMBL_1545148 (CHEMBL3750502)
IC50
75100±n/a nM
Citation
 Hanaki, MMurakami, KAkagi, KIrie, K Structural insights into mechanisms for inhibiting amyloidß42 aggregation by non-catechol-type flavonoids. Bioorg Med Chem 24:304-13 (2016)  
Target
Name:
Amyloid-beta precursor protein
Synonyms:
A4 ABPP AICD-50 AICD-59 AID(57) APP Alzheimer disease amyloid protein Amyloid beta Protein Amyloid beta protein Abeta(1-42) Amyloid intracellular domain 57 Amyloid protein (Abeta42b) Beta amyloid A4 protein Beta-APP42 Beta-amyloid protein 42 C83 CVAP Gamma Secretase Gamma-CTF(57) Gamma-secretase Gamma-secretase C-terminal fragment 57 P3(40) PN-II Protease nexin-II S-APP-beta Soluble APP-beta | beta-Amyloid Precursor Protein (APP)
Type:
Single-pass type I membrane protein
Mol. Mass.:
86890.41
Organism:
Homo sapiens (Human)
Description:
P05067
Residue:
770
  
Inhibitor
Name:
BDBM7462
Synonyms:
3,5,7-trihydroxy-2-(4-hydroxyphenyl)-4H-chromen-4-one CHEMBL150 Kaempferol (Kmp) kaempferol
Type:
Small organic molecule
Emp. Form.:
C15H10O6
Mol. Mass.:
286.2363
SMILES:
Oc1ccc(cc1)-c1oc2cc(O)cc(O)c2c(=O)c1O
: