Target
Prostaglandin E2 receptor EP1 subtype
Ligand
BDBM50138047
Substrate
Meas. Tech.
ChEMBL_1549764 (CHEMBL3757320)
Ki
120±n/a nM
Citation
 Kinoshita, AHigashino, MAratani, YKakuuchi, AMatsuya, HOhmoto, K Discovery of highly potent dual EP(2) and EP(3) agonists with subtype selectivity. Bioorg Med Chem Lett 26:1016-9 (2016)  
Target
Name:
Prostaglandin E2 receptor EP1 subtype
Synonyms:
PE2R1_HUMAN PTGER1 Prostaglandin E2 receptor EP1 subtype Prostanoid EP1 receptor
Type:
Enzyme
Mol. Mass.:
41834.57
Organism:
Homo sapiens (Human)
Description:
P34995
Residue:
402
  
Inhibitor
Name:
BDBM50138047
Synonyms:
CHEMBL3753853
Type:
Small organic molecule
Emp. Form.:
C19H28N2O5S2
Mol. Mass.:
428.566
SMILES:
CCCCC(C)(C)[C@H](O)\C=C\[C@H]1COC(=O)N1CCSc1nc(cs1)C(O)=O
: