Target
Free fatty acid receptor 1
Ligand
BDBM50138164
Substrate
Meas. Tech.
ChEMBL_1549475 (CHEMBL3755626)
EC50
97±n/a nM
Citation
 Ma, ZLin, DCSharma, RLiu, JZhu, LLi, ARKohn, TWang, YLiu, JJBartberger, MDMedina, JCZhuang, RLi, FZhang, JLuo, JWong, STonn, GRHouze, JB Discovery of the imidazole-derived GPR40 agonist AM-3189. Bioorg Med Chem Lett 26:15-20 (2015)  
Target
Name:
Free fatty acid receptor 1
Synonyms:
FFAR1 G-protein Coupled Receptor 40 | GPR40
Type:
G Protein-Coupled Receptor (GPCR)
Mol. Mass.:
31473.32
Organism:
Homo sapiens (Human)
Description:
O14842
Residue:
300
  
Inhibitor
Name:
BDBM50138164
Synonyms:
CHEMBL3753188
Type:
Small organic molecule
Emp. Form.:
C28H27ClN2O3
Mol. Mass.:
474.979
SMILES:
Cc1ccc(COc2ccc(cc2)[C@H](CC(O)=O)c2nccn2C)cc1-c1ccc(Cl)cc1C
: