Target
Free fatty acid receptor 1
Ligand
BDBM50138180
Substrate
Meas. Tech.
ChEMBL_1549474 (CHEMBL3755625)
EC50
130±n/a nM
Citation
 Ma, ZLin, DCSharma, RLiu, JZhu, LLi, ARKohn, TWang, YLiu, JJBartberger, MDMedina, JCZhuang, RLi, FZhang, JLuo, JWong, STonn, GRHouze, JB Discovery of the imidazole-derived GPR40 agonist AM-3189. Bioorg Med Chem Lett 26:15-20 (2015)  
Target
Name:
Free fatty acid receptor 1
Synonyms:
FFAR1 G-protein Coupled Receptor 40 | GPR40
Type:
G Protein-Coupled Receptor (GPCR)
Mol. Mass.:
31473.32
Organism:
Homo sapiens (Human)
Description:
O14842
Residue:
300
  
Inhibitor
Name:
BDBM50138180
Synonyms:
CHEMBL3754486
Type:
Small organic molecule
Emp. Form.:
C27H23F3N2O3
Mol. Mass.:
480.4783
SMILES:
Cn1ccnc1C(CC(O)=O)c1ccc(OCc2cccc(c2)-c2ccc(cc2)C(F)(F)F)cc1
: