Target
Free fatty acid receptor 1
Ligand
BDBM50138183
Substrate
Meas. Tech.
ChEMBL_1549474 (CHEMBL3755625)
EC50
190±n/a nM
Citation
 Ma, ZLin, DCSharma, RLiu, JZhu, LLi, ARKohn, TWang, YLiu, JJBartberger, MDMedina, JCZhuang, RLi, FZhang, JLuo, JWong, STonn, GRHouze, JB Discovery of the imidazole-derived GPR40 agonist AM-3189. Bioorg Med Chem Lett 26:15-20 (2015)  
Target
Name:
Free fatty acid receptor 1
Synonyms:
FFAR1 G-protein Coupled Receptor 40 | GPR40
Type:
G Protein-Coupled Receptor (GPCR)
Mol. Mass.:
31473.32
Organism:
Homo sapiens (Human)
Description:
O14842
Residue:
300
  
Inhibitor
Name:
BDBM50138183
Synonyms:
CHEMBL3752557
Type:
Small organic molecule
Emp. Form.:
C28H22F3NO3
Mol. Mass.:
477.4744
SMILES:
OC(=O)CC(c1ccncc1)c1ccc(OCc2cccc(c2)-c2ccc(cc2)C(F)(F)F)cc1
: