Target
Melanocortin receptor 4
Ligand
BDBM50019939
Substrate
Meas. Tech.
ChEMBL_1549671 (CHEMBL3756897)
EC50
640±n/a nM
Citation
 Ma, ZLin, DCSharma, RLiu, JZhu, LLi, ARKohn, TWang, YLiu, JJBartberger, MDMedina, JCZhuang, RLi, FZhang, JLuo, JWong, STonn, GRHouze, JB Discovery of the imidazole-derived GPR40 agonist AM-3189. Bioorg Med Chem Lett 26:15-20 (2015)  
Target
Name:
Melanocortin receptor 4
Synonyms:
MC4-R Mc4r
Type:
PROTEIN
Mol. Mass.:
36892.87
Organism:
Rattus norvegicus
Description:
ChEMBL_11005
Residue:
332
  
Inhibitor
Name:
BDBM50019939
Synonyms:
CHEMBL3287569
Type:
Small organic molecule
Emp. Form.:
C27H25ClN2O3
Mol. Mass.:
460.952
SMILES:
Cc1cc(Cl)ccc1-c1cccc(COc2ccc(cc2)[C@H](CC(O)=O)c2nccn2C)c1
: