Target
72 kDa type IV collagenase
Ligand
BDBM50138798
Substrate
Meas. Tech.
ChEMBL_1550088 (CHEMBL3756034)
IC50
1100±n/a nM
Citation
 Sjøli, SNuti, ECamodeca, CBilto, IRossello, AWinberg, JOSylte, IAdekoya, OA Synthesis, experimental evaluation and molecular modelling of hydroxamate derivatives as zinc metalloproteinase inhibitors. Eur J Med Chem 108:141-53 (2016)  
Target
Name:
72 kDa type IV collagenase
Synonyms:
72 kDa gelatinase CLG4A Gelatinase A (MMP-2) MMP2_HUMAN Matrix metalloproteinase-2 (MMP 2) Matrix metalloproteinases 2 (MMP-2) | TBE-1
Type:
Enzyme
Mol. Mass.:
73870.36
Organism:
Homo sapiens (Human)
Description:
P08253
Residue:
660
  
Inhibitor
Name:
BDBM50138798
Synonyms:
CHEMBL3754100
Type:
Small organic molecule
Emp. Form.:
C9H13BrN2O5S2
Mol. Mass.:
373.244
SMILES:
CC(C)ON(CC(=O)NO)S(=O)(=O)c1ccc(Br)s1
: