Target
Matrix metalloproteinase-9
Ligand
BDBM50138796
Substrate
Meas. Tech.
ChEMBL_1550087 (CHEMBL3756033)
IC50
>10000±n/a nM
Citation
 Sjøli, SNuti, ECamodeca, CBilto, IRossello, AWinberg, JOSylte, IAdekoya, OA Synthesis, experimental evaluation and molecular modelling of hydroxamate derivatives as zinc metalloproteinase inhibitors. Eur J Med Chem 108:141-53 (2016)  
Target
Name:
Matrix metalloproteinase-9
Synonyms:
67 kDa matrix metalloproteinase-9 92 kDa gelatinase CLG4B Gelatinase B MMP9 Matrix metalloproteinase 9 (MMP-9) Matrix metalloproteinase-9 (MMP9)
Type:
Enzyme
Mol. Mass.:
78452.28
Organism:
Homo sapiens (Human)
Description:
P14780
Residue:
707
  
Inhibitor
Name:
BDBM50138796
Synonyms:
CHEMBL3751971
Type:
Small organic molecule
Emp. Form.:
C25H22N2O7S
Mol. Mass.:
494.516
SMILES:
ONC(=O)Cc1ccccc1S(=O)(=O)c1ccc(OCCCN2C(=O)c3ccccc3C2=O)cc1
: