Target
72 kDa type IV collagenase
Ligand
BDBM50138800
Substrate
Meas. Tech.
ChEMBL_1550088 (CHEMBL3756034)
IC50
3.0±n/a nM
Citation
 Sjøli, SNuti, ECamodeca, CBilto, IRossello, AWinberg, JOSylte, IAdekoya, OA Synthesis, experimental evaluation and molecular modelling of hydroxamate derivatives as zinc metalloproteinase inhibitors. Eur J Med Chem 108:141-53 (2016)  
Target
Name:
72 kDa type IV collagenase
Synonyms:
72 kDa gelatinase CLG4A Gelatinase A (MMP-2) MMP2_HUMAN Matrix metalloproteinase-2 (MMP 2) Matrix metalloproteinases 2 (MMP-2) | TBE-1
Type:
Enzyme
Mol. Mass.:
73870.36
Organism:
Homo sapiens (Human)
Description:
P08253
Residue:
660
  
Inhibitor
Name:
BDBM50138800
Synonyms:
CHEMBL3754094
Type:
Small organic molecule
Emp. Form.:
C21H28N2O4S
Mol. Mass.:
404.523
SMILES:
CC(C)CN([C@H](C(C)C)C(=O)NO)S(=O)(=O)c1ccc(cc1)-c1ccccc1
: