Target
Elastase
Ligand
BDBM50138797
Substrate
Meas. Tech.
ChEMBL_1550089 (CHEMBL3756035)
IC50
16000±n/a nM
Citation
 Sjøli, SNuti, ECamodeca, CBilto, IRossello, AWinberg, JOSylte, IAdekoya, OA Synthesis, experimental evaluation and molecular modelling of hydroxamate derivatives as zinc metalloproteinase inhibitors. Eur J Med Chem 108:141-53 (2016)  
Target
Name:
Elastase
Synonyms:
ELAS_PSEAE lasB
Type:
PROTEIN
Mol. Mass.:
53687.94
Organism:
Pseudomonas aeruginosa
Description:
ChEMBL_619859
Residue:
498
  
Inhibitor
Name:
BDBM50138797
Synonyms:
CHEMBL3752374
Type:
Small organic molecule
Emp. Form.:
C25H21N3O6
Mol. Mass.:
459.4507
SMILES:
ONC(=O)[C@@H](CCN1C(=O)c2ccccc2C1=O)NC(=O)c1ccc(Oc2ccccc2)cc1
: