Target
Elastase
Ligand
BDBM50138796
Substrate
Meas. Tech.
ChEMBL_1550089 (CHEMBL3756035)
IC50
7000±n/a nM
Citation
 Sjøli, SNuti, ECamodeca, CBilto, IRossello, AWinberg, JOSylte, IAdekoya, OA Synthesis, experimental evaluation and molecular modelling of hydroxamate derivatives as zinc metalloproteinase inhibitors. Eur J Med Chem 108:141-53 (2016)  
Target
Name:
Elastase
Synonyms:
ELAS_PSEAE lasB
Type:
PROTEIN
Mol. Mass.:
53687.94
Organism:
Pseudomonas aeruginosa
Description:
ChEMBL_619859
Residue:
498
  
Inhibitor
Name:
BDBM50138796
Synonyms:
CHEMBL3751971
Type:
Small organic molecule
Emp. Form.:
C25H22N2O7S
Mol. Mass.:
494.516
SMILES:
ONC(=O)Cc1ccccc1S(=O)(=O)c1ccc(OCCCN2C(=O)c3ccccc3C2=O)cc1
: