Target
Thermolysin
Ligand
BDBM50138798
Substrate
Meas. Tech.
ChEMBL_1550091 (CHEMBL3756037)
IC50
29000±n/a nM
Citation
 Sjøli, SNuti, ECamodeca, CBilto, IRossello, AWinberg, JOSylte, IAdekoya, OA Synthesis, experimental evaluation and molecular modelling of hydroxamate derivatives as zinc metalloproteinase inhibitors. Eur J Med Chem 108:141-53 (2016)  
Target
Name:
Thermolysin
Synonyms:
THER_BACTH | npr
Type:
PROTEIN
Mol. Mass.:
60097.54
Organism:
Bacillus thermoproteolyticus
Description:
ChEMBL_1468794
Residue:
548
  
Inhibitor
Name:
BDBM50138798
Synonyms:
CHEMBL3754100
Type:
Small organic molecule
Emp. Form.:
C9H13BrN2O5S2
Mol. Mass.:
373.244
SMILES:
CC(C)ON(CC(=O)NO)S(=O)(=O)c1ccc(Br)s1
: