Target
Sphingosine kinase 2
Ligand
BDBM50139650
Substrate
Meas. Tech.
ChEMBL_1553855 (CHEMBL3767369)
Ki
1300±n/a nM
Citation
 Aurelio, LScullino, CVPitman, MRSexton, AOliver, VDavies, LRebello, RJFuric, LCreek, DJPitson, SMFlynn, BL From Sphingosine Kinase to Dihydroceramide Desaturase: A Structure-Activity Relationship (SAR) Study of the Enzyme Inhibitory and Anticancer Activity of 4-((4-(4-Chlorophenyl)thiazol-2-yl)amino)phenol (SKI-II). J Med Chem 59:965-84 (2016)  
Target
Name:
Sphingosine kinase 2
Synonyms:
SK 2 SPHK2 SPK 2 Sphingosine kinase types 2 (SphK2)
Type:
Protein
Mol. Mass.:
69221.44
Organism:
Homo sapiens (Human)
Description:
Q9NRA0
Residue:
654
  
Inhibitor
Name:
BDBM50139650
Synonyms:
CHEMBL3546834 | US9688668, 50
Type:
Small organic molecule
Emp. Form.:
C21H31N5O
Mol. Mass.:
369.5037
SMILES:
CCCCCCCCc1ccc(cc1)-c1noc(n1)[C@H]1CCCN1C(N)=N
: