Target
Vascular endothelial growth factor receptor 2
Ligand
BDBM50140184
Substrate
Meas. Tech.
ChEMBL_1547892 (CHEMBL3756969)
IC50
87±n/a nM
Citation
 Shan, YWang, CZhang, LWang, JWang, MDong, Y Expanding the structural diversity of diarylureas as multi-target tyrosine kinase inhibitors. Bioorg Med Chem 24:750-8 (2016)  
Target
Name:
Vascular endothelial growth factor receptor 2
Synonyms:
CD_antigen=CD309 Fetal liver kinase 1 (FLK-1) KDR Protein-tyrosine kinase receptor Flk-1 VEGFR-2 VEGFR2 Vascular Endothelial Growth Factor Receptor Kinase 2 Vascular endothelial growth factor receptor 2 (KDR) Vascular endothelial growth factor receptor 2 (VEGFR2) Vascular endothelial growth factor receptor-2 (VEGFR-2)
Type:
Receptor Tyrosine Kinase
Mol. Mass.:
151510.97
Organism:
Homo sapiens (Human)
Description:
P35968
Residue:
1356
  
Inhibitor
Name:
BDBM50140184
Synonyms:
CHEMBL3754556
Type:
Small organic molecule
Emp. Form.:
C15H10F3N5OS
Mol. Mass.:
365.333
SMILES:
FC(F)(F)c1cc(NC(=O)Nc2nccs2)cc(c1)-c1cncnc1
: