Target
Vascular endothelial growth factor receptor 2
Ligand
BDBM50140189
Substrate
Meas. Tech.
ChEMBL_1547892 (CHEMBL3756969)
IC50
223±n/a nM
Citation
 Shan, YWang, CZhang, LWang, JWang, MDong, Y Expanding the structural diversity of diarylureas as multi-target tyrosine kinase inhibitors. Bioorg Med Chem 24:750-8 (2016)  
Target
Name:
Vascular endothelial growth factor receptor 2
Synonyms:
CD_antigen=CD309 Fetal liver kinase 1 (FLK-1) KDR Protein-tyrosine kinase receptor Flk-1 VEGFR-2 VEGFR2 Vascular Endothelial Growth Factor Receptor Kinase 2 Vascular endothelial growth factor receptor 2 (KDR) Vascular endothelial growth factor receptor 2 (VEGFR2) Vascular endothelial growth factor receptor-2 (VEGFR-2)
Type:
Receptor Tyrosine Kinase
Mol. Mass.:
151510.97
Organism:
Homo sapiens (Human)
Description:
P35968
Residue:
1356
  
Inhibitor
Name:
BDBM50140189
Synonyms:
CHEMBL3754301
Type:
Small organic molecule
Emp. Form.:
C17H14F3N5O
Mol. Mass.:
361.3212
SMILES:
Cn1cnc(c1)-c1cc(NC(=O)Nc2ccncc2)cc(c1)C(F)(F)F
: