Target
Fibroblast growth factor receptor 1
Ligand
BDBM50140198
Substrate
Meas. Tech.
ChEMBL_1547893 (CHEMBL3756970)
IC50
81±n/a nM
Citation
 Shan, YWang, CZhang, LWang, JWang, MDong, Y Expanding the structural diversity of diarylureas as multi-target tyrosine kinase inhibitors. Bioorg Med Chem 24:750-8 (2016)  
Target
Name:
Fibroblast growth factor receptor 1
Synonyms:
BFGFR Basic fibroblast growth factor receptor 1 (FGFR1) CEK FGFR-1 FGFR-1, (FL) FGFR1_HUMAN FLT2 Fibroblast growth factor receptor 1 (FGFR-1) Fms-like tyrosine kinase 2 N-sam bFGF-R | c-fgr
Type:
Receptor
Mol. Mass.:
91861.70
Organism:
Homo sapiens (Human)
Description:
P11362
Residue:
822
  
Inhibitor
Name:
BDBM50140198
Synonyms:
CHEMBL3754057
Type:
Small organic molecule
Emp. Form.:
C17H12F3N5O2
Mol. Mass.:
375.3047
SMILES:
FC(F)(F)Oc1ccc(cc1NC(=O)Nc1ccccn1)-c1cncnc1
: