Target
Fibroblast growth factor receptor 1
Ligand
BDBM50140202
Substrate
Meas. Tech.
ChEMBL_1547893 (CHEMBL3756970)
IC50
138±n/a nM
Citation
 Shan, YWang, CZhang, LWang, JWang, MDong, Y Expanding the structural diversity of diarylureas as multi-target tyrosine kinase inhibitors. Bioorg Med Chem 24:750-8 (2016)  
Target
Name:
Fibroblast growth factor receptor 1
Synonyms:
BFGFR Basic fibroblast growth factor receptor 1 (FGFR1) CEK FGFR-1 FGFR-1, (FL) FGFR1_HUMAN FLT2 Fibroblast growth factor receptor 1 (FGFR-1) Fms-like tyrosine kinase 2 N-sam bFGF-R | c-fgr
Type:
Receptor
Mol. Mass.:
91861.70
Organism:
Homo sapiens (Human)
Description:
P11362
Residue:
822
  
Inhibitor
Name:
BDBM50140202
Synonyms:
CHEMBL3752404
Type:
Small organic molecule
Emp. Form.:
C18H13F3N4O
Mol. Mass.:
358.3172
SMILES:
FC(F)(F)c1cc(NC(=O)Nc2ccncc2)cc(c1)-c1cccnc1
: