Target
Fibroblast growth factor receptor 1
Ligand
BDBM50140181
Substrate
Meas. Tech.
ChEMBL_1547893 (CHEMBL3756970)
IC50
99±n/a nM
Citation
 Shan, YWang, CZhang, LWang, JWang, MDong, Y Expanding the structural diversity of diarylureas as multi-target tyrosine kinase inhibitors. Bioorg Med Chem 24:750-8 (2016)  
Target
Name:
Fibroblast growth factor receptor 1
Synonyms:
BFGFR Basic fibroblast growth factor receptor 1 (FGFR1) CEK FGFR-1 FGFR-1, (FL) FGFR1_HUMAN FLT2 Fibroblast growth factor receptor 1 (FGFR-1) Fms-like tyrosine kinase 2 N-sam bFGF-R | c-fgr
Type:
Receptor
Mol. Mass.:
91861.70
Organism:
Homo sapiens (Human)
Description:
P11362
Residue:
822
  
Inhibitor
Name:
BDBM50140181
Synonyms:
CHEMBL3753142
Type:
Small organic molecule
Emp. Form.:
C16H11F3N4OS
Mol. Mass.:
364.345
SMILES:
FC(F)(F)c1cc(NC(=O)Nc2nccs2)cc(c1)-c1cccnc1
: