Target
Epidermal growth factor receptor
Ligand
BDBM50140206
Substrate
Meas. Tech.
ChEMBL_1547891 (CHEMBL3756968)
IC50
103±n/a nM
Citation
 Shan, YWang, CZhang, LWang, JWang, MDong, Y Expanding the structural diversity of diarylureas as multi-target tyrosine kinase inhibitors. Bioorg Med Chem 24:750-8 (2016)  
Target
Name:
Epidermal growth factor receptor
Synonyms:
EGF Receptor Substrate EGFR_HUMAN ERBB1 Epidermal Growth Factor Receptor erbB-1 Epidermal growth factor receptor (EGFR) HER1 Proto-oncogene c-ErbB-1 Tyrosine-Protein Kinase ErbB-1
Type:
Receptor Kinase Domain
Mol. Mass.:
134279.59
Organism:
Homo sapiens (Human)
Description:
P00533
Residue:
1210
  
Inhibitor
Name:
BDBM50140206
Synonyms:
CHEMBL3753623
Type:
Small organic molecule
Emp. Form.:
C19H15F3N4O3
Mol. Mass.:
404.3426
SMILES:
COc1ccc(cn1)-c1ccc(OC(F)(F)F)c(NC(=O)Nc2ccncc2)c1
: