Target
Epidermal growth factor receptor
Ligand
BDBM50140184
Substrate
Meas. Tech.
ChEMBL_1547891 (CHEMBL3756968)
IC50
72±n/a nM
Citation
 Shan, YWang, CZhang, LWang, JWang, MDong, Y Expanding the structural diversity of diarylureas as multi-target tyrosine kinase inhibitors. Bioorg Med Chem 24:750-8 (2016)  
Target
Name:
Epidermal growth factor receptor
Synonyms:
EGF Receptor Substrate EGFR_HUMAN ERBB1 Epidermal Growth Factor Receptor erbB-1 Epidermal growth factor receptor (EGFR) HER1 Proto-oncogene c-ErbB-1 Tyrosine-Protein Kinase ErbB-1
Type:
Receptor Kinase Domain
Mol. Mass.:
134279.59
Organism:
Homo sapiens (Human)
Description:
P00533
Residue:
1210
  
Inhibitor
Name:
BDBM50140184
Synonyms:
CHEMBL3754556
Type:
Small organic molecule
Emp. Form.:
C15H10F3N5OS
Mol. Mass.:
365.333
SMILES:
FC(F)(F)c1cc(NC(=O)Nc2nccs2)cc(c1)-c1cncnc1
: