Target
Epidermal growth factor receptor
Ligand
BDBM50140196
Substrate
Meas. Tech.
ChEMBL_1547891 (CHEMBL3756968)
IC50
91±n/a nM
Citation
 Shan, YWang, CZhang, LWang, JWang, MDong, Y Expanding the structural diversity of diarylureas as multi-target tyrosine kinase inhibitors. Bioorg Med Chem 24:750-8 (2016)  
Target
Name:
Epidermal growth factor receptor
Synonyms:
EGF Receptor Substrate EGFR_HUMAN ERBB1 Epidermal Growth Factor Receptor erbB-1 Epidermal growth factor receptor (EGFR) HER1 Proto-oncogene c-ErbB-1 Tyrosine-Protein Kinase ErbB-1
Type:
Receptor Kinase Domain
Mol. Mass.:
134279.59
Organism:
Homo sapiens (Human)
Description:
P00533
Residue:
1210
  
Inhibitor
Name:
BDBM50140196
Synonyms:
CHEMBL3753208
Type:
Small organic molecule
Emp. Form.:
C18H13F3N4O2
Mol. Mass.:
374.3166
SMILES:
FC(F)(F)Oc1ccc(cc1NC(=O)Nc1ccccn1)-c1cccnc1
: