Target
Epidermal growth factor receptor
Ligand
BDBM50140195
Substrate
Meas. Tech.
ChEMBL_1547891 (CHEMBL3756968)
IC50
67±n/a nM
Citation
 Shan, YWang, CZhang, LWang, JWang, MDong, Y Expanding the structural diversity of diarylureas as multi-target tyrosine kinase inhibitors. Bioorg Med Chem 24:750-8 (2016)  
Target
Name:
Epidermal growth factor receptor
Synonyms:
EGF Receptor Substrate EGFR_HUMAN ERBB1 Epidermal Growth Factor Receptor erbB-1 Epidermal growth factor receptor (EGFR) HER1 Proto-oncogene c-ErbB-1 Tyrosine-Protein Kinase ErbB-1
Type:
Receptor Kinase Domain
Mol. Mass.:
134279.59
Organism:
Homo sapiens (Human)
Description:
P00533
Residue:
1210
  
Inhibitor
Name:
BDBM50140195
Synonyms:
CHEMBL3754785
Type:
Small organic molecule
Emp. Form.:
C20H20N4O4
Mol. Mass.:
380.3972
SMILES:
COc1ccc(cn1)-c1cc(NC(=O)Nc2ccccn2)cc(OC)c1OC
: