Target
Collagenase 3
Ligand
BDBM50142268
Substrate
Meas. Tech.
ChEMBL_1552458 (CHEMBL3761709)
Ki
5.8±n/a nM
Citation
 Ruminski, PGMassa, MStrohbach, JHanau, CESchmidt, MScholten, JAFletcher, TRHamper, BCCarroll, JNShieh, HSCaspers, NCollins, BGrapperhaus, MPalmquist, KECollins, JBaldus, JEHitchcock, JKleine, HPRogers, MDMcDonald, JMunie, GEMessing, DMPortolan, SWhiteley, LOSunyer, TSchnute, ME Discovery of N-(4-Fluoro-3-methoxybenzyl)-6-(2-(((2S,5R)-5-(hydroxymethyl)-1,4-dioxan-2-yl)methyl)-2H-tetrazol-5-yl)-2-methylpyrimidine-4-carboxamide. A Highly Selective and Orally Bioavailable Matrix Metalloproteinase-13 Inhibitor for the Potential Treatment of Osteoarthritis. J Med Chem 59:313-27 (2016)  
Target
Name:
Collagenase 3
Synonyms:
MMP-13 MMP13_HUMAN Matrix metalloproteinase-13 (MMP-13) | Matrix metalloproteinase-13 (MMP13)
Type:
Enzyme
Mol. Mass.:
53808.06
Organism:
Homo sapiens (Human)
Description:
P45452
Residue:
471
  
Inhibitor
Name:
BDBM50142268
Synonyms:
CHEMBL3758659
Type:
Small organic molecule
Emp. Form.:
C21H25N7O5
Mol. Mass.:
455.4671
SMILES:
COc1cccc(CNC(=O)c2cc(nc(C)n2)-c2nnn(C[C@H]3CO[C@H](CO)CO3)n2)c1
: