Target
Mu-type opioid receptor
Ligand
BDBM50142620
Substrate
Meas. Tech.
ChEMBL_1552638 (CHEMBL3762577)
Ki
0.042000±n/a nM
Citation
 Turnaturi, RAricò, GRonsisvalle, GParenti, CPasquinucci, L Multitarget opioid ligands in pain relief: New players in an old game. Eur J Med Chem 108:211-28 (2016)  
Target
Name:
Mu-type opioid receptor
Synonyms:
M-OR-1 MOR-1 MUOR1 Mu opiate receptor OPRM1 hMOP | mu-type opioid receptor isoform MOR-1
Type:
G Protein-Coupled Receptor (GPCR)
Mol. Mass.:
44789.51
Organism:
Homo sapiens (Human)
Description:
P35372
Residue:
400
  
Inhibitor
Name:
BDBM50142620
Synonyms:
CHEMBL3758712
Type:
Small organic molecule
Emp. Form.:
C29H32N4O4
Mol. Mass.:
500.5888
SMILES:
Cc1cc(O)cc(C)c1C[C@H](N)C(=O)N1Cc2ccccc2C[C@@H]1C(=O)NCC(=O)Nc1ccccc1
: