Target
Mu-type opioid receptor
Ligand
BDBM50142693
Substrate
Meas. Tech.
ChEMBL_1552638 (CHEMBL3762577)
Ki
0.380000±n/a nM
Citation
 Turnaturi, RAricò, GRonsisvalle, GParenti, CPasquinucci, L Multitarget opioid ligands in pain relief: New players in an old game. Eur J Med Chem 108:211-28 (2016)  
Target
Name:
Mu-type opioid receptor
Synonyms:
M-OR-1 MOR-1 MUOR1 Mu opiate receptor OPRM1 hMOP | mu-type opioid receptor isoform MOR-1
Type:
G Protein-Coupled Receptor (GPCR)
Mol. Mass.:
44789.51
Organism:
Homo sapiens (Human)
Description:
P35372
Residue:
400
  
Inhibitor
Name:
BDBM50142693
Synonyms:
CHEMBL3759238
Type:
Small organic molecule
Emp. Form.:
C21H27NO3
Mol. Mass.:
341.444
SMILES:
[H][C@@]12CCCC[C@@]11CCN(CC3CCCO3)[C@]2([H])C(=O)c2ccc(O)cc12
: