Target
Metabotropic glutamate receptor 5
Ligand
BDBM109136
Substrate
Meas. Tech.
ChEMBL_1552222 (CHEMBL3761224)
Ki
0.650000±n/a nM
Citation
 Topiol, SSabio, M 7TM X-ray structures for class C GPCRs as new drug-discovery tools. 1. mGluR5. Bioorg Med Chem Lett 26:484-94 (2016)  
Target
Name:
Metabotropic glutamate receptor 5
Synonyms:
GRM5_RAT Grm5 Mglur5 metabotropic glutamate 5/1-C metabotropic glutamate 5a
Type:
Enzyme
Mol. Mass.:
131900.14
Organism:
Rattus norvegicus (Rat)
Description:
P31424
Residue:
1203
  
Inhibitor
Name:
BDBM109136
Synonyms:
US8609852, 43
Type:
Small organic molecule
Emp. Form.:
C17H11ClN2S
Mol. Mass.:
310.801
SMILES:
Cc1nc(cs1)C#Cc1cncc(c1)-c1cccc(Cl)c1
: