Target
Metabotropic glutamate receptor 5
Ligand
BDBM50154977
Substrate
Meas. Tech.
ChEMBL_1552221 (CHEMBL3761223)
Ki
12±n/a nM
Citation
 Topiol, SSabio, M 7TM X-ray structures for class C GPCRs as new drug-discovery tools. 1. mGluR5. Bioorg Med Chem Lett 26:484-94 (2016)  
Target
Name:
Metabotropic glutamate receptor 5
Synonyms:
GRM5_RAT Grm5 Mglur5 metabotropic glutamate 5/1-C metabotropic glutamate 5a
Type:
Enzyme
Mol. Mass.:
131900.14
Organism:
Rattus norvegicus (Rat)
Description:
P31424
Residue:
1203
  
Inhibitor
Name:
BDBM50154977
Synonyms:
2-{2-[3-fluoro-5-(pyridin-3-yloxy)phenyl]-2H-tetrazol-5-yl}pyridine | CHEMBL186151
Type:
Small organic molecule
Emp. Form.:
C17H11FN6O
Mol. Mass.:
334.3072
SMILES:
Fc1cc(Oc2cccnc2)cc(c1)-n1nnc(n1)-c1ccccn1
: