Target
Melatonin receptor type 1A
Ligand
BDBM50037242
Substrate
Meas. Tech.
ChEMBL_1551499 (CHEMBL3762920)
Ki
0.150000±n/a nM
Citation
 Landagaray, EEttaoussi, MDuroux, RBoutin, JACaignard, DHDelagrange, PMelnyk, PBerthelot, PYous, S Melatonergic ligands: Design, synthesis and pharmacological evaluation of novel series of naphthofuranic derivatives. Eur J Med Chem 109:360-70 (2016)  
Target
Name:
Melatonin receptor type 1A
Synonyms:
MTNR1A MTR1A_HUMAN Mel1a melatonin receptor Melatonin receptor Melatonin receptor type 1 (MT1) | Melatonin receptor type 1A
Type:
Enzyme
Mol. Mass.:
39392.94
Organism:
Homo sapiens (Human)
Description:
P48039
Residue:
350
  
Inhibitor
Name:
BDBM50037242
Synonyms:
CHEMBL323332 N-[2-(5-Methoxy-benzofuran-3-yl)-ethyl]-acetamide
Type:
Small organic molecule
Emp. Form.:
C13H15NO3
Mol. Mass.:
233.2631
SMILES:
COc1ccc2occ(CCNC(C)=O)c2c1
: