Target
Epidermal growth factor receptor
Ligand
BDBM50144603
Substrate
Meas. Tech.
ChEMBL_1551515 (CHEMBL3760417)
IC50
>10000±n/a nM
Citation
 Zhang, HQGong, FHLi, CGZhang, CWang, YJXu, YGSun, LP Design and discovery of 4-anilinoquinazoline-acylamino derivatives as EGFR and VEGFR-2 dual TK inhibitors. Eur J Med Chem 109:371-9 (2016)  
Target
Name:
Epidermal growth factor receptor
Synonyms:
EGF Receptor Substrate EGFR_HUMAN ERBB1 Epidermal Growth Factor Receptor erbB-1 Epidermal growth factor receptor (EGFR) HER1 Proto-oncogene c-ErbB-1 Tyrosine-Protein Kinase ErbB-1
Type:
Receptor Kinase Domain
Mol. Mass.:
134279.59
Organism:
Homo sapiens (Human)
Description:
P00533
Residue:
1210
  
Inhibitor
Name:
BDBM50144603
Synonyms:
CHEMBL3759884
Type:
Small organic molecule
Emp. Form.:
C30H26N4O4
Mol. Mass.:
506.5518
SMILES:
COc1ccc(cc1)C(=O)Nc1ccc(Nc2ncnc3cc(OCc4ccccc4)c(OC)cc23)cc1
: