Target
Vascular endothelial growth factor receptor 2
Ligand
BDBM50144590
Substrate
Meas. Tech.
ChEMBL_1551514 (CHEMBL3760416)
IC50
2990±n/a nM
Citation
 Zhang, HQGong, FHLi, CGZhang, CWang, YJXu, YGSun, LP Design and discovery of 4-anilinoquinazoline-acylamino derivatives as EGFR and VEGFR-2 dual TK inhibitors. Eur J Med Chem 109:371-9 (2016)  
Target
Name:
Vascular endothelial growth factor receptor 2
Synonyms:
CD_antigen=CD309 Fetal liver kinase 1 (FLK-1) KDR Protein-tyrosine kinase receptor Flk-1 VEGFR-2 VEGFR2 Vascular Endothelial Growth Factor Receptor Kinase 2 Vascular endothelial growth factor receptor 2 (KDR) Vascular endothelial growth factor receptor 2 (VEGFR2) Vascular endothelial growth factor receptor-2 (VEGFR-2)
Type:
Receptor Tyrosine Kinase
Mol. Mass.:
151510.97
Organism:
Homo sapiens (Human)
Description:
P35968
Residue:
1356
  
Inhibitor
Name:
BDBM50144590
Synonyms:
CHEMBL3759015
Type:
Small organic molecule
Emp. Form.:
C29H30ClN5O4
Mol. Mass.:
548.033
SMILES:
COc1cc2c(Nc3ccc(NC(=O)c4cccc(Cl)c4)cc3)ncnc2cc1OCCCN1CCOCC1
: