Target
Bifunctional epoxide hydrolase 2
Ligand
BDBM25737
Substrate
Meas. Tech.
ChEMBL_1555240 (CHEMBL3768766)
IC50
107000±n/a nM
Citation
 Blöcher, RLamers, CWittmann, SKMerk, DHartmann, MWeizel, LDiehl, OBrüggerhoff, ABoß, MKaiser, ASchader, TGöbel, TGrundmann, MAngioni, CHeering, JGeisslinger, GWurglics, MKostenis, EBrüne, BSteinhilber, DSchubert-Zsilavecz, MKahnt, ASProschak, E N-Benzylbenzamides: A Novel Merged Scaffold for Orally Available Dual Soluble Epoxide Hydrolase/Peroxisome Proliferator-Activated Receptor¿ Modulators. J Med Chem 59:61-81 (2016)  
Target
Name:
Bifunctional epoxide hydrolase 2
Synonyms:
Cytosolic epoxide hydrolase 2 EPHX2 HYES_HUMAN Soluble epoxide hydrolase (sEH) | epoxide hydrolase 2, cytoplasmic
Type:
Enzyme
Mol. Mass.:
62613.07
Organism:
Homo sapiens (Human)
Description:
P34913
Residue:
555
  
Inhibitor
Name:
BDBM25737
Synonyms:
12-[(adamantan-1-ylcarbamoyl)amino]dodecanoic acid US10383835, Compound 700 | Urea-based compound, 18
Type:
Small organic molecule
Emp. Form.:
C23H40N2O3
Mol. Mass.:
392.5753
SMILES:
OC(=O)CCCCCCCCCCCNC(=O)NC12CC3CC(CC(C3)C1)C2
: