Target
Sodium-dependent serotonin transporter
Ligand
BDBM50092645
Substrate
Meas. Tech.
ChEMBL_1554468 (CHEMBL3767599)
IC50
5000±n/a nM
Citation
 Edmondson, SDZhu, CKar, NFDi Salvo, JNagabukuro, HSacre-Salem, BDingley, KBerger, RGoble, SDMorriello, GHarper, BMoyes, CRShen, DMWang, LBall, RFitzmaurice, AFrenkl, TGichuru, LNHa, SHurley, ALJochnowitz, NLevorse, DMistry, SMiller, RROrmes, JSalituro, GMSanfiz, AStevenson, ASVilla, KZamlynny, BGreen, SStruthers, MWeber, AE Discovery of Vibegron: A Potent and Selectiveß3 Adrenergic Receptor Agonist for the Treatment of Overactive Bladder. J Med Chem 59:609-23 (2016)  
Target
Name:
Sodium-dependent serotonin transporter
Synonyms:
5-HT Transporter 5HTT SC6A4_HUMAN SLC6A4 Serotonin transporter (5HTT) Sodium-dependent serotonin transporter (SERT) | Solute carrier family 6 member 4
Type:
Multi-pass membrane protein
Mol. Mass.:
70322.51
Organism:
Homo sapiens (Human)
Description:
P31645
Residue:
630
  
Inhibitor
Name:
BDBM50092645
Synonyms:
(R)-N-(4-(2-(2-hydroxy-2-(pyridin-3-yl)ethylamino)ethyl)phenyl)-4-(4-(4-(trifluoromethyl)phenyl)thiazol-2-yl)benzenesulfonamide L-796568 N-{4-[2-((R)-2-hydroxy-2-pyridin-3-yl-ethylamino)-ethyl]-phenyl}-4-[3-(4-trifluoromethyl-phenyl)-thiazol-2-yl]-benzenesulfonamide | N-{4-[2-(2-Hydroxy-2-pyridin-3-yl-ethylamino)-ethyl]-phenyl}-4-[4-(4-trifluoromethyl-phenyl)-thiazol-2-yl]-benzenesulfonamide
Type:
Small organic molecule
Emp. Form.:
C31H27F3N4O3S2
Mol. Mass.:
624.696
SMILES:
O[C@@H](CNCCc1ccc(NS(=O)(=O)c2ccc(cc2)-c2nc(cs2)-c2ccc(cc2)C(F)(F)F)cc1)c1cccnc1
: