Target
Cytochrome P450 3A4
Ligand
BDBM50092645
Substrate
Meas. Tech.
ChEMBL_1554473 (CHEMBL3767770)
IC50
9300±n/a nM
Citation
 Edmondson, SDZhu, CKar, NFDi Salvo, JNagabukuro, HSacre-Salem, BDingley, KBerger, RGoble, SDMorriello, GHarper, BMoyes, CRShen, DMWang, LBall, RFitzmaurice, AFrenkl, TGichuru, LNHa, SHurley, ALJochnowitz, NLevorse, DMistry, SMiller, RROrmes, JSalituro, GMSanfiz, AStevenson, ASVilla, KZamlynny, BGreen, SStruthers, MWeber, AE Discovery of Vibegron: A Potent and Selectiveß3 Adrenergic Receptor Agonist for the Treatment of Overactive Bladder. J Med Chem 59:609-23 (2016)  
Target
Name:
Cytochrome P450 3A4
Synonyms:
Albendazole monooxygenase CP3A4_HUMAN CYP3A4 CYPIIIA4 Cytochrome P450 3A4 (CYP3A4) Nifedipine oxidase Taurochenodeoxycholate 6-alpha-hydroxylase
Type:
Enzyme
Mol. Mass.:
57349.57
Organism:
Homo sapiens (Human)
Description:
Residue:
503
  
Inhibitor
Name:
BDBM50092645
Synonyms:
(R)-N-(4-(2-(2-hydroxy-2-(pyridin-3-yl)ethylamino)ethyl)phenyl)-4-(4-(4-(trifluoromethyl)phenyl)thiazol-2-yl)benzenesulfonamide L-796568 N-{4-[2-((R)-2-hydroxy-2-pyridin-3-yl-ethylamino)-ethyl]-phenyl}-4-[3-(4-trifluoromethyl-phenyl)-thiazol-2-yl]-benzenesulfonamide | N-{4-[2-(2-Hydroxy-2-pyridin-3-yl-ethylamino)-ethyl]-phenyl}-4-[4-(4-trifluoromethyl-phenyl)-thiazol-2-yl]-benzenesulfonamide
Type:
Small organic molecule
Emp. Form.:
C31H27F3N4O3S2
Mol. Mass.:
624.696
SMILES:
O[C@@H](CNCCc1ccc(NS(=O)(=O)c2ccc(cc2)-c2nc(cs2)-c2ccc(cc2)C(F)(F)F)cc1)c1cccnc1
: