Target
Hepatocyte growth factor receptor
Ligand
BDBM50100615
Substrate
Meas. Tech.
ChEMBL_1554826 (CHEMBL3766504)
IC50
14±n/a nM
Citation
 Zhang, JJiang, XJiang, YGuo, MZhang, SLi, JHe, JLiu, JWang, JOuyang, L Recent advances in the development of dual VEGFR and c-Met small molecule inhibitors as anticancer drugs. Eur J Med Chem 108:495-504 (2016)  
Target
Name:
Hepatocyte growth factor receptor
Synonyms:
Hepatocyte growth factor receptor Hepatocyte growth factor receptor (c-MET) MET Met proto-oncogene (hepatocyte growth factor receptor) Tyrosine-protein kinase Met (c-Met) c-Met kinase
Type:
Protein
Mol. Mass.:
155559.73
Organism:
Homo sapiens (Human)
Description:
P08581
Residue:
1390
  
Inhibitor
Name:
BDBM50100615
Synonyms:
E-7050 Golvatinib
Type:
Small organic molecule
Emp. Form.:
C33H37F2N7O4
Mol. Mass.:
633.6882
SMILES:
CN1CCN(CC1)C1CCN(CC1)C(=O)Nc1cc(Oc2ccc(NC(=O)C3(CC3)C(=O)Nc3ccc(F)cc3)c(F)c2)ccn1
: