Target
Protein cereblon
Ligand
BDBM7814
Substrate
Meas. Tech.
ChEMBL_1555520 (CHEMBL3768102)
Ki
26200±n/a nM
Citation
 Boichenko, IDeiss, SBär, KHartmann, MDHernandez Alvarez, B A FRET-Based Assay for the Identification and Characterization of Cereblon Ligands. J Med Chem 59:770-4 (2016)  
Target
Name:
Protein cereblon
Synonyms:
CRBN | CRBN_HUMAN
Type:
PROTEIN
Mol. Mass.:
50537.73
Organism:
Homo sapiens (Human)
Description:
ChEMBL_116917
Residue:
442
  
Inhibitor
Name:
BDBM7814
Synonyms:
Maleimide-Related Compound 13 | pyrrolidine-2,5-dione
Type:
Small organic molecule
Emp. Form.:
C4H5NO2
Mol. Mass.:
99.088
SMILES:
O=C1CCC(=O)N1
: