Target
Carbonic anhydrase 2
Ligand
BDBM10869
Substrate
Meas. Tech.
ChEMBL_1553894 (CHEMBL3767548)
Ki
19±n/a nM
Citation
 Vullo, DDe Luca, VDel Prete, SCarginale, VScozzafava, AOsman, SMAlOthman, ZCapasso, CSupuran, CT Sulfonamide inhibition studies of theż-carbonic anhydrase from the Antarctic bacterium Colwellia psychrerythraea. Bioorg Med Chem Lett 26:1253-9 (2016)  
Target
Name:
Carbonic anhydrase 2
Synonyms:
CA-II CAC Carbonate dehydratase II Carbonic anhydrase 2 (CA-II) Carbonic anhydrase C Carbonic anhydrase II (CA-II) Carbonic anhydrase II (hCA II) | Carbonic anhydrase isoenzyme II (hCA II)
Type:
Enzyme
Mol. Mass.:
29250.71
Organism:
Homo sapiens (Human)
Description:
P00918
Residue:
260
  
Inhibitor
Name:
BDBM10869
Synonyms:
5-imino-4-methyl-4,5-dihydro-1,3,4-thiadiazole-2-sulfonamide aromatic/heteroaromatic sulfonamide 14
Type:
Small organic molecule
Emp. Form.:
C3H6N4O2S2
Mol. Mass.:
194.235
SMILES:
Cn1nc(sc1=N)S(N)(=O)=O
: