Target
Diacylglycerol lipase-alpha
Ligand
BDBM50148188
Substrate
Meas. Tech.
ChEMBL_1553495 (CHEMBL3768666)
IC50
3±n/a nM
Citation
 Chupak, LSZheng, XHu, SHuang, YDing, MLewis, MAWestphal, RSBlat, YMcClure, AGentles, RG Structure activity relationship studies on chemically non-reactive glycine sulfonamide inhibitors of diacylglycerol lipase. Bioorg Med Chem 24:1455-68 (2016)  
Target
Name:
Diacylglycerol lipase-alpha
Synonyms:
C11orf11 DGLA_HUMAN NSDDR | Sn1-specific diacylglycerol lipase alpha
Type:
PROTEIN
Mol. Mass.:
114947.74
Organism:
Homo sapiens (Human)
Description:
ChEMBL_1449471
Residue:
1042
  
Inhibitor
Name:
BDBM50148188
Synonyms:
CHEMBL3763826
Type:
Small organic molecule
Emp. Form.:
C26H25Cl2NO5S
Mol. Mass.:
534.451
SMILES:
CC1(C)CCc2cc(ccc2O1)S(=O)(=O)N(CC(O)=O)Cc1cccc(c1)-c1cc(Cl)cc(Cl)c1
: