Target
Mu-type opioid receptor
Ligand
BDBM50148257
Substrate
Meas. Tech.
ChEMBL_1553558 (CHEMBL3769090)
Ki
13±n/a nM
Citation
 Adamska, AKluczyk, ACerlesi, MCCalo, GJanecka, ABorics, A Synthesis, biological evaluation and structural analysis of novel peripherally active morphiceptin analogs. Bioorg Med Chem 24:1582-8 (2016)  
Target
Name:
Mu-type opioid receptor
Synonyms:
MOR-1 Mu-type opioid receptor (MOR) OPRM_RAT Opioid receptor B Ror-b
Type:
G Protein-Coupled Receptor (GPCR)
Mol. Mass.:
44503.11
Organism:
Rattus norvegicus (rat)
Description:
Competition binding assays were carried out using membrane preparations from transfected HN9.10 cells that constitutively expressed the mu opioid receptor.
Residue:
398
  
Inhibitor
Name:
BDBM50148257
Synonyms:
CHEMBL3764219
Type:
Small organic molecule
Emp. Form.:
C28H33F2N5O5
Mol. Mass.:
557.5889
SMILES:
N[C@@H](Cc1ccc(O)cc1)C(=O)N1CCC[C@H]1C(=O)N[C@@H](Cc1ccccc1)C(=O)N1CC(F)(F)C[C@@H]1C(N)=O
: