Target
Kappa-type opioid receptor
Ligand
BDBM50148256
Substrate
Meas. Tech.
ChEMBL_1553560 (CHEMBL3769092)
Ki
>1000±n/a nM
Citation
 Adamska, AKluczyk, ACerlesi, MCCalo, GJanecka, ABorics, A Synthesis, biological evaluation and structural analysis of novel peripherally active morphiceptin analogs. Bioorg Med Chem 24:1582-8 (2016)  
Target
Name:
Kappa-type opioid receptor
Synonyms:
Kappa Opioid Receptor OPRK1 Opiate Kappa 1 | mu/kappa opioid receptor
Type:
G Protein-Coupled Receptor (GPCR)
Mol. Mass.:
42744.99
Organism:
Cavia porcellus (domestic guinea pig)
Description:
P41144
Residue:
380
  
Inhibitor
Name:
BDBM50148256
Synonyms:
CHEMBL3765790
Type:
Small organic molecule
Emp. Form.:
C28H33F2N5O5
Mol. Mass.:
557.5889
SMILES:
N[C@@H](Cc1ccc(O)cc1)C(=O)N1CC(F)(F)C[C@@H]1C(=O)N[C@@H](Cc1ccccc1)C(=O)N1CCC[C@H]1C(N)=O
: