Target
Transcription intermediary factor 1-alpha
Ligand
BDBM50148467
Substrate
Meas. Tech.
ChEMBL_1558044 (CHEMBL3771488)
IC50
1560±n/a nM
Citation
 Bennett, JFedorov, OTallant, CMonteiro, OMeier, JGamble, VSavitsky, PNunez-Alonso, GAHaendler, BRogers, CBrennan, PEMüller, SKnapp, S Discovery of a Chemical Tool Inhibitor Targeting the Bromodomains of TRIM24 and BRPF. J Med Chem 59:1642-7 (2016)  
Target
Name:
Transcription intermediary factor 1-alpha
Synonyms:
6.3.2.- RING finger protein 82 RNF82 TIF1-alpha TIF1A_HUMAN Transcription intermediary factor 1-alpha | Tripartite motif-containing protein 24
Type:
PROTEIN
Mol. Mass.:
116839.55
Organism:
Homo sapiens (Human)
Description:
ChEMBL_107998
Residue:
1050
  
Inhibitor
Name:
BDBM50148467
Synonyms:
CHEMBL3770004
Type:
Small organic molecule
Emp. Form.:
C21H18ClN3O4S
Mol. Mass.:
443.903
SMILES:
Cn1c2cc(NS(=O)(=O)c3ccc(Cl)cc3)c(Oc3ccccc3)cc2n(C)c1=O
: