Target
Histone deacetylase 6
Ligand
BDBM50397360
Substrate
Meas. Tech.
ChEMBL_1556977 (CHEMBL3772308)
IC50
4570±n/a nM
Citation
 Reddy, DNBallante, FChuang, TPirolli, AMarrocco, BMarshall, GR Design and Synthesis of Simplified Largazole Analogues as Isoform-Selective Human Lysine Deacetylase Inhibitors. J Med Chem 59:1613-33 (2016)  
Target
Name:
Histone deacetylase 6
Synonyms:
Cereblon/Histone deacetylase 6 HDAC6 Histone deacetylase 6 (HDAC6) KIAA0901 | ORF Names:JM21
Type:
Chromatin regulator; hydrolase; repressor
Mol. Mass.:
131381.51
Organism:
Homo sapiens (Human)
Description:
Q9UBN7
Residue:
1215
  
Inhibitor
Name:
BDBM50397360
Synonyms:
CHEMBL2170177 | US10188756, Compound CN110
Type:
Small organic molecule
Emp. Form.:
C17H16N2O3
Mol. Mass.:
296.3205
SMILES:
COc1ccc(Cn2ccc3ccc(cc23)C(=O)NO)cc1
: