Target
NAD-dependent protein deacetylase sirtuin-2
Ligand
BDBM50148827
Substrate
Meas. Tech.
ChEMBL_1557227 (CHEMBL3773602)
IC50
1450±n/a nM
Citation
 Schiedel, MRumpf, TKaraman, BLehotzky, AOláh, JGerhardt, SOvádi, JSippl, WEinsle, OJung, M Aminothiazoles as Potent and Selective Sirt2 Inhibitors: A Structure-Activity Relationship Study. J Med Chem 59:1599-612 (2016)  
Target
Name:
NAD-dependent protein deacetylase sirtuin-2
Synonyms:
NAD-Dependent Deacetylase Sirtuin-2 NAD-dependent deacetylase sirtuin 3 SIR2-like SIR2L SIR2_HUMAN Sirtuin 2 (SIRT2)
Type:
Hydrolase
Mol. Mass.:
43172.62
Organism:
Homo sapiens (Human)
Description:
Residue:
389
  
Inhibitor
Name:
BDBM50148827
Synonyms:
CHEMBL3769975
Type:
Small organic molecule
Emp. Form.:
C28H26N4O2S
Mol. Mass.:
482.597
SMILES:
COc1ccc2ccccc2c1Cn1cnc2sc3CC(CCc3c2c1=O)NCc1cccnc1
: