Target
5-hydroxytryptamine receptor 7
Ligand
BDBM50148831
Substrate
Meas. Tech.
ChEMBL_1557242 (CHEMBL3773617)
Ki
401±n/a nM
Citation
 Zhou, YMa, JLin, XHuang, XPWu, KHuang, N Structure-Based Discovery of Novel and Selective 5-Hydroxytryptamine 2B Receptor Antagonists for the Treatment of Irritable Bowel Syndrome. J Med Chem 59:707-20 (2016)  
Target
Name:
5-hydroxytryptamine receptor 7
Synonyms:
5-HT-7 5-HT7 5-HT7S 5HT7 HTR7 | Serotonin receptor 7
Type:
G Protein-Coupled Receptor (GPCR)
Mol. Mass.:
53573.08
Organism:
Homo sapiens (Human)
Description:
P34969
Residue:
479
  
Inhibitor
Name:
BDBM50148831
Synonyms:
CHEMBL3770342
Type:
Small organic molecule
Emp. Form.:
C14H18BrN5
Mol. Mass.:
336.23
SMILES:
NC1=NC2(CCCCC2)NC(Nc2cccc(Br)c2)=N1
: